{"text_format":"1","workbook":"xlsx","n_sheets":16,"sheets":["ePermitting ROI Calculator Home","Time to Market Start","Time to Market Inputs","Time to Market Results","Time to Market Background Calcs","Trusted Transactions Start","Trusted Transactions Inputs","Trusted Transactions Results","Trusted Trans. Background Calcs","Right Info, Right Time Start","Right Info, Right Time Inputs","Right Info, Right Time Results","Right Info, Right Time Calcs","BEA1","BEA2","Text Options"],"not_rendered":{"charts":0,"images":4,"macros":1,"external_links":0,"defined_names":46,"comments":0,"pivot_tables":0},"unopened":[],"bounds":{"document_bytes":16777216,"sheet_cells":100000,"rows_first":2000,"rows_last":500,"rows_between":2000,"halvings":0,"cell_chars":16384,"cell_head_chars":4096},"cells_cut":0,"cells_raw":0,"read":"whole","date_system":"1900"}

{"sheet":"ePermitting ROI Calculator Home","index":0,"n_rows":18,"n_cols":4,"rows_kept":18,"cut":false,"hidden":false,"merged":[[1,2,1,4],[17,1,19,5],[0,1,0,5],[11,1,12,5]]}
[null,"ePermitting ROI Metrics Calculator"]
[]
[null,null,null,"Primary Metric"]
[null,null,null,"TIME TO MARKET"]
[]
[]
[]
[]
[]
[]
[]
[null,"Estimate gains in economic activity associated with reduced permit processing times. "]
[]
[]
[]
[]
[null,null,null,"Additional Metrics"]
[null,"These metrics describe two types of economic benefits (and cost savings) to the regulated community and the public that often result from improved permitting systems. These metrics expand on traditional ROI measures because they are not typically considered in direct cost savings estimates, which tend to focus on immediate savings to agencies and applicants."]

{"sheet":"Time to Market Start","index":1,"n_rows":5,"n_cols":3,"rows_kept":5,"cut":false,"hidden":false,"merged":[[1,2,3,4],[4,2,16,4]]}
[]
[null,null,"ePERMITTING BENEFITS CALCULATOR:\n TIME TO MARKET METRIC"]
[]
[]
[null,null,"This tool allows states to estimate the benefits to the private sector of reducing the processing time for environmental permits, so that economic activity (construction, industrial, or commercial activity) can start sooner. \n\n\"Time to market\" refers to the schedule for starting business operations at a facility. Permitting processes can increase the time to market (delay operations) for facilities; this delays economic activity. Reducing permit processing time can therefore increase economic activity by ensuring that operations begin sooner, as well as increasing productivity and reducing permitting-related costs for permit applicants, and reducing scheduling uncertainty that can affect financing.  \n\nThis tool specifically measures the opportunity cost of lost economic activity associated with waiting for the final permit decision. Project benefits are measured as the dollar value of additional days of economic activity per year."]

{"sheet":"Time to Market Inputs","index":2,"n_rows":78,"n_cols":6,"rows_kept":78,"cut":false,"hidden":false,"merged":[[77,2,78,4],[75,2,75,3],[66,2,67,4],[68,2,74,4],[47,3,48,3],[57,2,63,4],[55,2,56,4],[64,2,64,3],[50,2,53,4],[44,5,46,5],[1,2,2,3],[8,2,9,3],[45,2,46,2],[10,2,13,4],[33,2,33,4],[38,2,39,4],[42,2,43,4],[40,2,41,4],[37,2,37,4],[44,3,45,3],[15,2,27,4],[3,2,5,3],[35,2,35,4],[28,2,32,4]]}
[]
[null,null,"In which state is your project being implemented?"]
[]
[null,null,"Select a state from the drop-down list by clicking in the cell below. Select 'United States' to use national-level data."]
[]
[]
[null,null,"State:"]
[]
[null,null,"What industry does the permit in question affect?"]
[]
[null,null,"This tool assesses the time-to-market benefits associated with projects that reduce processing times for a given permit and enable operations to start. Select the industry regulated by your permit from the drop-down list in the cell below."]
[]
[]
[]
[null,null,"Commercial Construction"]
[null,null,"If your permit addresses multiple sectors, or if you are not sure which sector(s) is most applicable, the model suggests that you select \"commercial construction\" as a default proxy for economic activity. Commercial construction is a reasonable indicator of \"typical\" economic activity in this context because:\n\n     1) it is similar in scale (size, in percentage of GDP) to other key sectors that \n         require environmental permitting, such as the waste remediation sector; \n\n     2) it is present in all 50 states;\n\n     3) it explicitly requires permits to begin operation at most sites;\n\n     4) it is used by the World Bank as a consistent metric for the intersection\n         between economic activity and permitting."]
[]
[]
[]
[]
{"$rows_left_out":59}
{"sheet":"Time to Market Results","index":3,"n_rows":40,"n_cols":26,"rows_kept":40,"cut":false,"hidden":false,"merged":[[2,1,2,23],[8,1,8,22],[10,1,11,1],[10,2,11,19],[14,9,14,17],[38,1,38,24],[22,5,22,8],[32,8,32,14],[27,19,31,23],[32,19,34,23],[16,17,17,23],[18,9,18,17],[29,8,30,18],[31,8,31,15],[27,5,27,14],[25,7,25,18]]}
[]
[]
[null,"Beyond ROI Metrics: Time to Market"]
[]
[null,"Processing times for permit approvals can prevent facilities from engaging in economic activity."]
[null,"This tool calculates additional economic activity from reduced permit processing time."]
[]
[null,"The World Bank estimates that the average U.S. permit processing time for commercial construction is 81 days.1"]
[]
[]
[null,"In",{"$f":"IF(the_tm=1,\"the \",\"\")&state_tm&\":\"","v":":"}]
[]
[null,null,null,null,null,null,null,null,null,null,null,null,null,null,null,null,null,null,null,null,null,null,null,null,null,{"$f":"'Time to Market Background Calcs'!E7","v":0}]
[null,4,"A day of economic activity in the",null,null,null,null,{"$f":"TRIM(LOWER(industry_tm))&\" sector in \"&IF(the_tm=1,\"the \",\"\")&state_tm","v":" sector in "},null,null,null,null,null,null,null,null,null,null,null,null,null,null,null,null,null,{"$f":"'Time to Market Background Calcs'!E6","v":0}]
[null,null,null,null,null,null,null,null,"is worth",{"$f":"IF('Time to Market Background Calcs'!E19<100,DOLLAR('Time to Market Background Calcs'!E19,1),DOLLAR('Time to Market Background Calcs'!E19,0))&\" million\"","v":{"$error":"#N/A"}},null,null,null,null,null,null,null,null," in GDP.2"]
[]
[null,4,"A day of economic activity at an average facility in the ",null,null,null,null,null,null,null,null,null,null,null,null,null,null,{"$f":"TRIM(LOWER(industry_tm))&\" sector in \"&IF(the_tm=1,\"the \",\"\")&state_tm","v":" sector in "}]
[]
[null,null,null,null,null,null,null,"is worth",null,{"$f":"DOLLAR('Time to Market Background Calcs'!E13*1000000,0)","v":{"$error":"#N/A"}},null,null,null,null,null,null,null,null," in GDP.3"]
[]
{"$rows_left_out":21}
{"sheet":"Time to Market Background Calcs","index":4,"n_rows":70,"n_cols":5,"rows_kept":70,"cut":false,"hidden":false,"merged":[[55,1,57,1],[63,2,63,4],[64,1,67,1],[42,2,42,4],[43,1,45,1],[54,2,54,4],[43,2,44,4],[51,3,51,4],[60,3,60,4],[57,2,59,4],[55,2,56,4],[64,2,65,4],[67,3,68,4],[69,3,71,4],[5,2,5,3],[6,2,6,3],[21,2,22,4],[23,2,24,4],[25,3,26,4],[30,2,31,4],[33,2,34,4],[45,2,49,4],[32,2,32,4],[35,2,37,4],[27,3,29,4],[40,2,40,4],[38,2,39,4]]}
[]
[null,null,null,"State:",{"$f":"IF('Time to Market Inputs'!D7=\"\",\"\",'Time to Market Inputs'!D7)","v":""}]
[null,null,null,"Industry:",{"$f":"industry_tm","v":0}]
[null,null,"(A)",{"$f":"IF(ISBLANK(E3)=TRUE,\"\",\"  Percent of \"&TRIM(LOWER(E3))&\" in \"&E2&\":\")","v":"  Percent of 0 in :"},{"$f":"IF('Time to Market Inputs'!E46=\"\",\"\",'Time to Market Inputs'!E46)","v":""}]
[null,null,"(B)",{"$f":"\" \"&TRIM(E3)&\" establishments in \"&E2&\":\"","v":" 0 establishments in :"},{"$f":"IF('Time to Market Inputs'!E49=\"\",\"\",'Time to Market Inputs'!E49)","v":""}]
[null,null,"Days for permit approval:",null,{"$f":"'Time to Market Inputs'!E65","v":0}]
[null,"user inputs","Days for permit approval:",null,{"$f":"'Time to Market Inputs'!E76","v":0}]
[null,"outputs",null,"Change in days",{"$f":"E6-E7","v":0}]
[null,null,null,"Total establishments in state:",{"$f":"IFERROR(INDEX('BEA2'!E2:E880,MATCH(E2&E3,'BEA2'!B2:B880&'BEA2'!C2:C880,0)),\"\")","v":""}]
[null,null,null,"Total GDP",{"$f":"INDEX('BEA2'!D2:D880,MATCH(E2&E3,'BEA2'!B2:B880&'BEA2'!C2:C880,0))","v":{"$error":"#N/A"}}]
[null,null,null,null,{"$f":"E10*E17","v":{"$error":"#N/A"}}]
[null,null,null,"One-Facility GDP",{"$f":"E10/E9","v":{"$error":"#N/A"}}]
[null,null,null,"One-facility-day",{"$f":"E12/365","v":{"$error":"#N/A"}}]
[null,null,null,"Total facilities in calculation",{"$f":"IF(E5=\"\",(E4*E9),E5)","v":{"$error":"#VALUE!"}}]
[null,null,null,null,{"$f":"E16*Change_permit_time","v":{"$error":"#N/A"}}]
[null,null,null,"Total GDP per day",{"$f":"E11/365","v":{"$error":"#N/A"}}]
[null,null,null,"Percent of industry",{"$f":"IF(E4<>\"\",E4,IF(E5<>\"\",(E5/INDEX('BEA2'!E2:E880,MATCH(E2&E3,'BEA2'!B2:B880&'BEA2'!C2:C880,0))),\"\"))","v":""}]
[null,null,null,"Percent of industry",{"$f":"IF(E4=\"\",E5/E9,E4)","v":{"$error":"#VALUE!"}}]
[null,null,null,"Daily whole industry gdp",{"$f":"E10/365","v":{"$error":"#N/A"}}]
[null,null,null,"Total Benefits",{"$f":"IF(ABS('Time to Market Background Calcs'!C28)<10,\"< $0.1\",IF(ABS('Time to Market Background Calcs'!C28)<100,TEXT('Time to Market Background Calcs'!C28,\"$#,##0.0\"),TEXT('Time to Market Background Calcs'!C28,\"$#,##0\")))&\" million\"","v":{"$error":"#N/A"}}]
{"$rows_left_out":51}
{"sheet":"Trusted Transactions Start","index":5,"n_rows":10,"n_cols":2,"rows_kept":10,"cut":false,"hidden":false,"merged":[[1,1,2,3],[4,1,8,3],[9,1,14,3]]}
[]
[null,"ePERMITTING BENEFITS CALCULATOR:\nTRUSTED TRANSACTIONS METRIC"]
[]
[]
[null,"Trusted transactions include more efficient, transparent interfaces and systems, which can reduce the high cost of negative and/or defensive interactions between the regulated community and the regulating agency. The benefits to the regulated community include increased certainty by the applicant that interactions will result in positive, productive outcomes with high confidence in the process, rather than protracted formal exchanges with uncertain timing and/or results. "]
[]
[]
[]
[]
[null,"This metric quantifies the value to regulated entities of realigning compliance staff to additional value-added use. This tool includes several national averages for compliance staff time and wages, which can be used or customized by the user. The only inputs required are the number of firms affected by the relevant permit/requirement and the estimated percent of compliance staff time that can be repurposed to value-added use due to the permit process improvement.  "]

{"sheet":"Trusted Transactions Inputs","index":6,"n_rows":50,"n_cols":4,"rows_kept":50,"cut":false,"hidden":false,"merged":[[14,1,15,3],[12,1,12,2],[1,1,2,3],[10,1,11,3],[3,1,4,3],[5,1,6,3],[44,1,47,3],[49,1,49,2],[35,1,38,3],[21,0,21,2],[16,1,19,3],[33,1,34,3],[42,1,43,3],[40,1,40,2],[25,1,29,3],[31,1,31,2],[23,1,24,3]]}
[]
[null,"TRUSTED TRANSACTIONS"]
[]
[null,"In which state is your project being implemented?"]
[]
[null,"Select a state from the drop-down list by clicking in the cell below. Select 'United States' to use national-level data."]
[]
[]
[null,"State:"]
[]
[null,"How many firms are affected by your ePermitting streamlining?"]
[]
[null,"Enter number of firms affected:"]
[]
[null,"Weekly Compliance Time Before Process Improvement"]
[]
[null,"The average weekly per-firm compliance time spent is 3.5 hours, according to the Thomson Reuters Cost of Compliance 2015. This is the average for all firms, and all compliance, so there may be a difference in environmental compliance for the applicable firms, particularly for smaller businesses. This tool uses this average of 3.5 hours/week unless you choose to enter a new number in the cell below."]
[]
[]
[]
{"$rows_left_out":31}
{"sheet":"Trusted Transactions Results","index":7,"n_rows":42,"n_cols":23,"rows_kept":42,"cut":false,"hidden":false,"merged":[[33,14,33,17],[39,3,40,28],[41,3,42,28],[37,14,37,17],[34,20,37,20],[35,14,35,16],[36,14,36,18],[34,14,34,18],[2,2,3,28],[12,2,13,2],[12,3,13,16],[4,2,9,28],[10,2,11,28],[28,13,29,22],[15,16,15,18],[28,3,29,12],[15,19,15,21],[25,5,25,7],[25,8,25,14],[25,15,25,17]]}
[]
[]
[null,null,"Beyond ROI Metrics: Trusted Transactions"]
[]
[null,null,"More efficient, transparent interfaces and systems can reduce the high cost of interactions between regulated firms and the regulating agency. An increase in trusted transactions can allow regulated firms to realign compliance staff time toward value-added use, improving economic efficiency and productivity."]
[]
[]
[]
[]
[]
[null,null,"Thomson Reuters estimates that each firm spends an average of 3.5 hours per week on compliance.1"]
[]
[null,null,"In",{"$f":"IF(the_tt=1,\"the \",\"\")&state_tt&\":\"","v":":"}]
[]
[]
[null,null,null,"4 Annual regulatory compliance labor costs for",null,null,null,null,null,null,null,null,null,null,null,null,{"$f":"num_firms_tt","v":0},null,null,"firms in",null,null,{"$f":"IF(the_tt=1,\"the \",\"\")&state_tt","v":""}]
[]
[null,null,null,null,null,null,null,null,null,null,null,null,null,null,"are",{"$f":"DOLLAR('Trusted Trans. Background Calcs'!D9,0)","v":"$0"}]
[]
[null,null,null,"4 Annual regulatory compliance labor costs for a single firm in",null,null,null,null,null,null,null,null,null,null,null,null,null,null,null,null,{"$f":"IF(the_tt=1,\"the \",\"\")&state_tt","v":""}]
{"$rows_left_out":23}
{"sheet":"Trusted Trans. Background Calcs","index":8,"n_rows":44,"n_cols":6,"rows_kept":44,"cut":false,"hidden":false,"merged":[[12,1,13,3],[21,1,22,3],[24,1,24,3],[36,2,36,3],[41,2,41,3],[43,2,43,3],[14,1,14,3],[30,1,30,3],[38,1,38,3],[16,2,18,3],[33,2,34,3],[28,2,28,3],[26,2,26,3]]}
[]
[null,"Inputs",null,null,null,"Output Sheet"]
[null,"State",null,{"$f":"'Trusted Transactions Inputs'!C9","v":0},null,{"$f":"D3","v":0}]
[null,"Total Regulated Firms (number of permits)",null,{"$f":"'Trusted Transactions Inputs'!D13","v":0},null,{"$f":"D4","v":0}]
[null,"Weekly Compliance Time",null,{"$f":"'Trusted Transactions Inputs'!D22","v":3.5},null,3.5]
[null,"Annual Compliance Time",null,{"$f":"D5*time_period_tt","v":182},null,182]
[null,"Average Compliance Staff Cost",null,{"$f":"'Trusted Transactions Inputs'!D41","v":48.48},null,48.48]
[null,"per Firm Annual Compliance cost",null,{"$f":"D7*D6","v":8823.3599999999988},null,8823.3599999999988]
[null,"Total Colorado Compliance costs",null,{"$f":"D8*D4","v":0},null,0]
[null,"Reduction in time",null,{"$f":"'Trusted Transactions Inputs'!D50","v":0},null,0]
[null,"Reduction in Compliance costs",null,{"$f":"D10*D9","v":0},null,0]
[]
[null,"RESULTS"]
[]
[null,"Trusted Transactions Benefits from Repurposing Compliance Staff"]
[]
[null,{"$f":"D9","v":0},{"$f":"\"in annual costs associated with regulatory compliance staffing in \"&IF(the_tt=1,\"the \",\"\")&state_tt&\" for the facilities considered x \"&D10*100&\" percent repurposing of compliance labor\"","v":"in annual costs associated with regulatory compliance staffing in  for the facilities considered x 0 percent repurposing of compliance labor"}]
[]
[]
[null,{"$f":"D11","v":0},"in total compliance staff repurposed to value-added use"]
{"$rows_left_out":25}
{"sheet":"Right Info, Right Time Start","index":9,"n_rows":5,"n_cols":3,"rows_kept":5,"cut":false,"hidden":false,"merged":[[1,2,2,4],[4,2,16,4]]}
[]
[null,null,"ePERMITTING BENEFITS CALCULATOR:\n RIGHT INFO, RIGHT TIME METRIC"]
[]
[]
[null,null,"The \"right info, right time\" metric estimates the value of time saved by the public/industry when it becomes easier to access data and conduct transactions (e.g., online driver’s license renewals vs. in-person). This benefit captures the value of enabling the regulated community or public to pull high-quality information from a platform, rather than having to directly request information or otherwise interface with agency staff to make questions or needs known.  \n\nEnhanced access to information through electronic platforms reduces time users spend searching for information, and minimizes the need to file formal requests to obtain data (e.g., FOIA requests). Users also have the flexibility to conduct transactions outside of business hours (as electronic platforms feature round-the-clock access) and save time by receiving information quickly and electronically. \n\nAdditional benefits may accrue due to savings on travel time and costs, materials, and increased productivity, but these are not included in this analysis."]

{"sheet":"Right Info, Right Time Inputs","index":10,"n_rows":45,"n_cols":7,"rows_kept":45,"cut":false,"hidden":false,"merged":[[44,1,44,2],[36,1,36,2],[37,1,38,3],[39,1,42,3],[21,1,24,3],[29,1,30,3],[31,1,33,3],[25,1,27,2],[1,1,1,3],[13,1,13,2],[34,1,35,2],[9,1,11,3],[7,1,8,3],[19,1,20,3],[2,1,3,3],[17,2,17,3],[15,1,16,2]]}
[]
[null,"In which state is your project being implemented?"]
[null,"Select a state from the drop-down list by clicking in the cell below. Select 'United States' to use national-level data."]
[]
[]
[null,"State:"]
[]
[null,"Total Information Requests/Transactions Affected by Streamlining ePermitting Processes"]
[]
[null,"This metric uses the number of transactions affected by the ePermitting process improvements to determine the overall cost savings to the public and firms in your state. How many information requests or transactions do you respond to from facilities/citizens considered in this analysis?"]
[]
[]
[]
[null,"Enter number of transactions/requests you respond to:"]
[]
[null,"Enter the time period over which this number of transactions/requests takes place:",null,null,null,null,"One day"]
[null,null,null,null,null,null,"One month"]
[null,null,"Choose one day/month/year from the drop-down by clicking in the cell",null,null,null,"One year"]
[]
[null,"Average Time of Each Information Request/Transaction"]
{"$rows_left_out":26}
{"sheet":"Right Info, Right Time Results","index":11,"n_rows":42,"n_cols":31,"rows_kept":42,"cut":false,"hidden":false,"merged":[[13,2,14,15],[2,1,3,32],[5,1,8,32],[9,1,12,32],[13,1,14,1],[18,14,18,19],[22,14,22,19],[39,1,40,32],[37,12,37,14],[35,12,35,15],[34,12,34,14],[36,12,36,17],[32,1,32,23],[29,1,30,11],[29,12,30,19],[29,20,30,23],[29,24,30,29],[29,30,30,32]]}
[]
[]
[null,"Beyond ROI Metrics: Right Info, Right Time"]
[]
[]
[null,"It takes time for the public and/or firms to conduct transactions and request information from the government in-person. Providing the right information at the right time can increase economic efficiency."]
[]
[]
[]
[null,"Deloitte estimates that the average time to request information or conduct a transaction with the government is 10 minutes (0.17 hours), extrapolating Deloitte's findings to the national population suggests that there are 1.16 billion such requests in the United States each year.1"]
[]
[]
[]
[null,"In",{"$f":"IF(the_rr=1,\"the \",\"\")&state_rr&\":\"","v":":"}]
[]
[]
[null,null,"4 One year of transactions/requests for firms and citizens considered in this analysis",null,null,null,null,null,null,null,null,null,null,null,null,null,null,null,null,null,null,null,null,null,null,{"$f":"\"in \"&IF(the_rr=1,\"the \",\"\")&state_rr","v":"in "}]
[]
[null,null,null,null,null,null,null,null,null,null,null,null,null,"takes",{"$f":"TEXT('Right Info, Right Time Calcs'!D8*'Right Info, Right Time Calcs'!D6,\"#,##0\")&\" hours\"","v":{"$error":"#VALUE!"}},null,null,null,null,null,"to complete."]
[]
{"$rows_left_out":23}
{"sheet":"Right Info, Right Time Calcs","index":12,"n_rows":42,"n_cols":4,"rows_kept":42,"cut":false,"hidden":false,"merged":[[12,1,13,3],[28,2,28,3],[29,1,29,3],[38,2,39,3],[41,2,42,3],[22,1,22,3],[25,1,27,3],[14,2,16,3],[34,1,34,3],[31,2,32,3],[18,2,18,3],[20,1,21,3],[23,1,24,3],[35,1,36,3]]}
[]
[null,"Inputs"]
[null,"State",null,{"$f":"'Right Info, Right Time Inputs'!C6","v":0}]
[null,"State transactions",null,{"$f":"'Right Info, Right Time Inputs'!D14","v":0}]
[null,"Time period",null,{"$f":"'Right Info, Right Time Inputs'!D17","v":0}]
[null,"Total transactions",null,{"$f":"IF(D5=\"One day\",D4*365,IF(D5=\"One month\",D4*12,IF(D5=\"One year\",D4,\"\")))","v":""}]
[null,"Wage Rate",null,{"$f":"'Right Info, Right Time Inputs'!D36","v":17.809999999999999}]
[null,"Avg time of transaction",null,{"$f":"'Right Info, Right Time Inputs'!D28","v":0.17}]
[null,"Total cost",null,{"$f":"D8*D7*D6","v":{"$error":"#VALUE!"}}]
[null,"Reduction in time",null,{"$f":"'Right Info, Right Time Inputs'!D45","v":0}]
[null,"Total benefits",null,{"$f":"D10*D9","v":{"$error":"#VALUE!"}}]
[]
[null,"RESULTS"]
[]
[null,{"$f":"D9","v":{"$error":"#VALUE!"}},{"$f":"\"in annual costs associated with requesting information and conducting transactions in \"&IF(the_rr=1,\"the \",\"\")&state_rr&\" × \"&D10*100&\" percent reduction in total time\"","v":"in annual costs associated with requesting information and conducting transactions in  × 0 percent reduction in total time"}]
[]
[]
[]
[null,{"$f":"D11","v":{"$error":"#VALUE!"}},"in savings associated with ePermitting process improvements"]
[]
{"$rows_left_out":23}
{"sheet":"BEA1","index":13,"n_rows":53,"n_cols":4,"rows_kept":53,"cut":false,"hidden":false,"merged":[]}
["Area","State","Fips","Proportion of All Industry Total GDP 2015"]
["United States","US","00",1]
["Alabama","AL","01",1.1000000000000001E-2]
["Alaska","AK","02",3.0000000000000001E-3]
["Arizona","AZ","04",1.6E-2]
["Arkansas","AR","05",6.9999999999999993E-3]
["California","CA","06",0.13800000000000001]
["Colorado","CO","08",1.8000000000000002E-2]
["Connecticut","CT","09",1.3999999999999999E-2]
["Delaware","DE","10",4.0000000000000001E-3]
["District of Columbia","DC","11",6.9999999999999993E-3]
["Florida","FL","12",0.05]
["Georgia","GA","13",2.7999999999999997E-2]
["Hawaii","HI","15",4.0000000000000001E-3]
["Idaho","ID","16",4.0000000000000001E-3]
["Illinois","IL","17",4.2999999999999997E-2]
["Indiana","IN","18",1.9E-2]
["Iowa","IA","19",0.01]
["Kansas","KS","20",8.0000000000000002E-3]
["Kentucky","KY","21",1.1000000000000001E-2]
{"$rows_left_out":34}
{"sheet":"BEA2","index":14,"n_rows":880,"n_cols":5,"rows_kept":880,"cut":false,"hidden":false,"merged":[]}
["BEA code","State","Industry","GDP (mil $)","Establishments"]
["1","United States","All industry total",17925143,7663938]
["10","United States","Utilities",284331,17990]
["11","United States","All construction",732120,682390]
["11.1","United States","Commercial Construction",110049,38565]
["12","United States","All manufacturing",2170275,292825]
["16","United States","Primary metals manufacturing",55923,4533]
["3","United States","Agriculture, forestry, fishing, and hunting",175236,22368]
["32","United States","Chemical products manufacturing",377315,13182]
["34","United States","Wholesale trade",1093237,413437]
["35","United States","Retail trade",1056781,1070209]
["36","United States","Transportation and warehousing",542528,228382]
["6","United States","Mining",327796,29225]
["67","United States","Waste management and remediation",45059,23875]
["7","United States","Oil and gas extraction",206171,7906]
["70","United States","Health care and social assistance",1298901,876072]
["78","United States","Accommodation and food services",524179,687619]
["81","United States","Other services, except government",401652,746046]
["1","Alabama","All industry total",199980,98540]
["10","Alabama","Utilities",5289,426]
{"$rows_left_out":861}
{"sheet":"Text Options","index":15,"n_rows":58,"n_cols":10,"rows_kept":58,"cut":false,"hidden":false,"merged":[]}
["Tool","National:","state selected","Needs a \"the\"",null,null,null,"industry_list_2",null,"New States List"]
["TM",{"$f":"IF(state_tm=\"United States\",1,0)","v":0},{"$f":"state_tm","v":0},{"$f":"IF(OR(C2=$A$7,C2=$A$8,C2=$A$9,C2=$A$10),1,0)","v":0},null,null,null,null,null,"United States"]
["TT",{"$f":"IF(state_tt=\"United States\",1,0)","v":0},{"$f":"state_tt","v":0},{"$f":"IF(OR(C3=$A$7,C3=$A$8,C3=$A$9,C3=$A$10),1,0)","v":0},null,null,null,"Commercial construction",null,"Alabama"]
["RR",{"$f":"IF(state_rr=\"United States\",1,0)","v":0},{"$f":"state_rr","v":0},{"$f":"IF(OR(C4=$A$7,C4=$A$8,C4=$A$9,C4=$A$10),1,0)","v":0},null,null,null,"----------------------------------------------------",null,"Alaska"]
[null,null,null,null,null,null,null,"All industry total",null,"Arizona"]
["Regions needing a \"the\"",null,null,null,null,null,null,"Mining",null,"Arkansas"]
["District of Columbia",null,null,null,null,null,null,"Oil and gas extraction",null,"California"]
["United States",null,null,null,null,null,null,"Utilities",null,"Colorado"]
["Northern Mariana Islands",null,null,null,null,null,null,"Waste management and remediation",null,"Connecticut"]
["U.S. Virgin Islands",null,null,null,null,null,null,"All construction",null,"Delaware"]
[null,null,null,null,null,null,null,"All manufacturing",null,"District of Columbia"]
["default_time_tt",3.5,null,null,null,null,null,"Primary metals manufacturing",null,"Florida"]
["default_wage_tt",48.48,null,null,null,null,null,"Chemical products manufacturing",null,"Georgia"]
["default_period_tt",52,null,null,null,null,null,"Wholesale trade",null,"Hawaii"]
["default_time_rr",0.17,null,null,null,null,null,"Retail trade",null,"Idaho"]
["default_wage_rr",17.809999999999999,null,null,null,null,null,"Transportation and warehousing",null,"Illinois"]
[null,null,null,null,null,null,null,"Health care and social assistance",null,"Indiana"]
[null,null,null,null,null,null,null,"Accommodation and food services",null,"Iowa"]
["BEA code","State","Industry","GDP (mil $)","Establishments",null,null,"Agriculture, forestry, fishing, and hunting",null,"Kansas"]
["7","Connecticut","Oil and gas extraction",0,5,null,null,"Other services, except government",null,"Kentucky"]
{"$rows_left_out":38}